{"text_format":"1","workbook":"xlsx","n_sheets":9,"sheets":["мужчины б.","женщины б.","мужчины ск.","женщины ск.","мужчины тр.","женщины тр.","разряды м.","разряды ж.","Лист1"],"not_rendered":{"charts":0,"images":0,"macros":0,"external_links":0,"defined_names":7,"comments":0,"pivot_tables":0},"unopened":[],"bounds":{"document_bytes":16777216,"sheet_cells":100000,"rows_first":2000,"rows_last":500,"rows_between":2000,"halvings":0,"cell_chars":16384,"cell_head_chars":4096},"cells_cut":0,"cells_raw":0,"read":"whole","date_system":"1900"}

{"sheet":"мужчины б.","index":0,"n_rows":67,"n_cols":10,"rows_kept":67,"cut":false,"hidden":false,"merged":[[3,4,4,4],[0,0,0,9],[1,0,1,9],[2,0,2,2],[2,9,4,9],[3,0,4,0],[3,1,4,1],[3,2,4,2],[3,3,4,3]]}
["Текущий рейтинг"]
["Мужчины, болдеринг"]
["на 9.03.2015 года",null,null,null,null,"КРБ-2013","ЧРБ-2014","КРБ-2014","ЧРБ-2015","общий рез-т"]
["№","Фамилия, Имя","Команда","г.р.","Подтвержденный разряд","Пинск","Минск","Пинск","Минск"]
[null,null,null,null,null,"22-25.11","21-23.02","22-23.11","27.02-1.03"]
[1,"Клюжев Александр",{"$f":"VLOOKUP(B6:B67,'разряды м.'!$A$5:$AB$205,2,FALSE)","v":"Гомельская обл."},{"$f":"VLOOKUP(B6:B67,'разряды м.'!$A$5:$AB$205,3,FALSE)","v":1997},{"$f":"VLOOKUP(B:B,'разряды м.'!$A$5:$AB$205,28,FALSE)","v":"МС"},91.2,82.9,45.5,80,{"$f":"SUM(F6:I6)","v":299.60000000000002}]
[2,"Никифоровец Максим",{"$f":"VLOOKUP(B7:B68,'разряды м.'!$A$5:$AB$205,2,FALSE)","v":"Минск"},{"$f":"VLOOKUP(B7:B68,'разряды м.'!$A$5:$AB$205,3,FALSE)","v":1997},{"$f":"VLOOKUP(B:B,'разряды м.'!$A$5:$AB$205,28,FALSE)","v":"КМС"},59.3,66.3,null,64,189.6]
[3,"Никифоровец Андрей",{"$f":"VLOOKUP(B8:B69,'разряды м.'!$A$5:$AB$205,2,FALSE)","v":"Минск"},{"$f":"VLOOKUP(B8:B69,'разряды м.'!$A$5:$AB$205,3,FALSE)","v":1974},{"$f":"VLOOKUP(B:B,'разряды м.'!$A$5:$AB$205,28,FALSE)","v":"МС"},73,null,70,37.6,180.6]
[4,"Волосович Дмитрий",{"$f":"VLOOKUP(B9:B70,'разряды м.'!$A$5:$AB$205,2,FALSE)","v":"Гомельская обл."},{"$f":"VLOOKUP(B9:B70,'разряды м.'!$A$5:$AB$205,3,FALSE)","v":1995},{"$f":"VLOOKUP(B:B,'разряды м.'!$A$5:$AB$205,28,FALSE)","v":"КМС"},50.2,45.6,null,52,147.80000000000001]
[5,"Драбинко Артур",{"$f":"VLOOKUP(B10:B71,'разряды м.'!$A$5:$AB$205,2,FALSE)","v":"Бобруйск"},{"$f":"VLOOKUP(B10:B71,'разряды м.'!$A$5:$AB$205,3,FALSE)","v":1994},{"$f":"VLOOKUP(B:B,'разряды м.'!$A$5:$AB$205,28,FALSE)","v":"КМС"},20.100000000000001,42.3,56,null,118.4]
{"$rows_left_out":58}
{"sheet":"женщины б.","index":1,"n_rows":48,"n_cols":10,"rows_kept":48,"cut":false,"hidden":false,"merged":[[0,0,0,4],[1,0,1,4],[2,0,2,2],[3,4,4,4],[2,9,4,9],[3,0,4,0],[3,1,4,1],[3,2,4,2],[3,3,4,3]]}
["Текущий рейтинг"]
["Женщины, болдеринг"]
["на 9.03.2015 года",null,null,null,null,"КРБ-2013","ЧРБ-2014","КРБ-2014","ЧРБ-2015","общий рез-т"]
["№ п/п","Фамилия, Имя","Команда","г.р.","Подтвержденный разряд","Пинск","Минск","Пинск","Минск"]
[null,null,null,null,null,"22-25.11","21-23.02","22-23.11","27.02-1.03"]
[1,"Рак Ольга",{"$f":"VLOOKUP($B$6:$B$48,'разряды ж.'!$A$5:$AB$202,2,FALSE)","v":"Пуховичский р-н"},{"$f":"VLOOKUP($B$6:$B$48,'разряды ж.'!$A$5:$AB$202,3,FALSE)","v":1985},{"$f":"VLOOKUP($B$6:$B$48,'разряды ж.'!$A$5:$AB$202,28,FALSE)","v":"МС"},89.5,88,36,60.2,{"$f":"SUM(F6:I6)","v":273.7}]
[2,"Малыженкова Лариса",{"$f":"VLOOKUP($B$6:$B$48,'разряды ж.'!$A$5:$AB$202,2,FALSE)","v":"Минск"},{"$f":"VLOOKUP($B$6:$B$48,'разряды ж.'!$A$5:$AB$202,3,FALSE)","v":1975},{"$f":"VLOOKUP($B$6:$B$48,'разряды ж.'!$A$5:$AB$202,28,FALSE)","v":"КМС"},57.9,69.099999999999994,null,46.2,173.2]
[3,"Веретенникова Елена",{"$f":"VLOOKUP($B$6:$B$48,'разряды ж.'!$A$5:$AB$202,2,FALSE)","v":"Минск"},{"$f":"VLOOKUP($B$6:$B$48,'разряды ж.'!$A$5:$AB$202,3,FALSE)","v":1991},{"$f":"VLOOKUP($B$6:$B$48,'разряды ж.'!$A$5:$AB$202,28,FALSE)","v":"КМС"},45.2,54.9,null,35.700000000000003,135.80000000000001]
[4,"Андреева Елена",{"$f":"VLOOKUP($B$6:$B$48,'разряды ж.'!$A$5:$AB$202,2,FALSE)","v":"Гомельская обл."},{"$f":"VLOOKUP($B$6:$B$48,'разряды ж.'!$A$5:$AB$202,3,FALSE)","v":1982},{"$f":"VLOOKUP($B$6:$B$48,'разряды ж.'!$A$5:$AB$202,28,FALSE)","v":"КМС"},35.299999999999997,41.6,13.5,18.2,108.60000000000001]
[5,"Лясович Наталья",{"$f":"VLOOKUP($B$6:$B$48,'разряды ж.'!$A$5:$AB$202,2,FALSE)","v":"Витебск"},{"$f":"VLOOKUP($B$6:$B$48,'разряды ж.'!$A$5:$AB$202,3,FALSE)","v":1985},{"$f":"VLOOKUP($B$6:$B$48,'разряды ж.'!$A$5:$AB$202,28,FALSE)","v":1},22.6,37.799999999999997,18.5,23.1,102]
{"$rows_left_out":39}
{"sheet":"мужчины ск.","index":2,"n_rows":36,"n_cols":9,"rows_kept":36,"cut":false,"hidden":false,"merged":[[0,0,0,8],[2,0,3,0],[2,1,3,1],[2,2,3,2],[2,3,3,3],[1,8,3,8],[2,4,3,4]]}
["Текущий рейтинг. Скорость. Мужчины."]
[null,"на 1.05.2015 года",null,null,null,"ЧРБ-2013","КБ-2014","ЧРБ-2015","общий рез-т"]
["Место ","Фамилия Имя","Команда","г.р.","Подтвержденный разряд","Витебск","Витебск","Витебск"]
[null,null,null,null,null,"5-8.12.","10-13.04.","17-20.04.15"]
[1,"Караваев Дмитрий",{"$f":"VLOOKUP(B5:B28,'разряды м.'!$A$5:$AB$205,2,FALSE)","v":"Гомельская обл."},{"$f":"VLOOKUP(B5:B66,'разряды м.'!$A$5:$AB$205,3,FALSE)","v":1993},{"$f":"VLOOKUP(B:B,'разряды м.'!$A$5:$AB$205,28,FALSE)","v":"КМС"},49.1,51.2,71.317823908375075,{"$f":"SUM(F5:H5)","v":171.6178239083751}]
[2,"Клюжев Александр",{"$f":"VLOOKUP(B6:B29,'разряды м.'!$A$5:$AB$205,2,FALSE)","v":"Гомельская обл."},{"$f":"VLOOKUP(B6:B67,'разряды м.'!$A$5:$AB$205,3,FALSE)","v":1997},{"$f":"VLOOKUP(B:B,'разряды м.'!$A$5:$AB$205,28,FALSE)","v":"МС"},40.6,37.700000000000003,42.293128131710802,120.59312813171081]
[3,"Дюбенков Дмитрий",{"$f":"VLOOKUP(B7:B30,'разряды м.'!$A$5:$AB$205,2,FALSE)","v":"Гомельская обл."},{"$f":"VLOOKUP(B7:B68,'разряды м.'!$A$5:$AB$205,3,FALSE)","v":1992},{"$f":"VLOOKUP(B:B,'разряды м.'!$A$5:$AB$205,28,FALSE)","v":"КМС"},78.7,27.6,2.4878310665712235,108.78783106657123]
[4,"Вальковский Владимир",{"$f":"VLOOKUP(B8:B31,'разряды м.'!$A$5:$AB$205,2,FALSE)","v":"ГОЦТиКДиМ Гомель"},{"$f":"VLOOKUP(B8:B69,'разряды м.'!$A$5:$AB$205,3,FALSE)","v":1992},{"$f":"VLOOKUP(B:B,'разряды м.'!$A$5:$AB$205,28,FALSE)","v":"КМС"},null,20.9,54.732283464566919,75.63228346456691]
[5,"Логунов Никита",{"$f":"VLOOKUP(B9:B32,'разряды м.'!$A$5:$AB$205,2,FALSE)","v":"ДЮСШ «Омега» Гом."},{"$f":"VLOOKUP(B9:B70,'разряды м.'!$A$5:$AB$205,3,FALSE)","v":1999},{"$f":"VLOOKUP(B:B,'разряды м.'!$A$5:$AB$205,28,FALSE)","v":"КМС"},33.9,null,34.000357909806723,67.900357909806729]
[6,"Денисевич Евгений",{"$f":"VLOOKUP(B10:B33,'разряды м.'!$A$5:$AB$205,2,FALSE)","v":"Брестская область"},{"$f":"VLOOKUP(B10:B71,'разряды м.'!$A$5:$AB$205,3,FALSE)","v":1994},{"$f":"VLOOKUP(B:B,'разряды м.'!$A$5:$AB$205,28,FALSE)","v":"КМС"},61.8,null,null,61.8]
{"$rows_left_out":27}
{"sheet":"женщины ск.","index":3,"n_rows":20,"n_cols":9,"rows_kept":20,"cut":false,"hidden":false,"merged":[[0,0,0,8],[3,0,4,0],[3,1,4,1],[3,2,4,2],[3,3,4,3],[2,8,4,8],[3,4,4,4]]}
["Текущий рейтинг. Скорость. Женщины."]
[]
[null,"на 1.05.2015 года",null,null,null,"ЧРБ-2013","КБ-2014","ЧРБ-2015","общий рез-т"]
["Место ","Фамилия Имя","Команда","г.р.","Подтвержденный разряд","Витебск","Витебск","Витебск"]
[null,null,null,null,null,"5-8.12.","10-13.04.","17-20.04.15"]
[1,"Федоркевич Светлана",{"$f":"VLOOKUP(B6:B16,'разряды ж.'!$A$5:$AB$202,2,FALSE)","v":"ГОЦТиКДиМ"},{"$f":"VLOOKUP(B6:B16,'разряды ж.'!$A$5:$AB$202,3,FALSE)","v":1992},{"$f":"VLOOKUP(B6:B34,'разряды ж.'!$A$5:$AB$202,28,FALSE)","v":"КМС"},21.4,23.4,null,{"$f":"SUM(F6:H6)","v":44.8}]
[2,"Кореневская Вероника",{"$f":"VLOOKUP(B7:B17,'разряды ж.'!$A$5:$AB$202,2,FALSE)","v":"Минск"},{"$f":"VLOOKUP(B7:B17,'разряды ж.'!$A$5:$AB$202,3,FALSE)","v":1997},{"$f":"VLOOKUP(B7:B35,'разряды ж.'!$A$5:$AB$202,28,FALSE)","v":2},5.5,14.6,13.434343434343432,33.534343434343434]
[3,"Ермохина Дарья",{"$f":"VLOOKUP(B8:B18,'разряды ж.'!$A$5:$AB$202,2,FALSE)","v":"РЦЭК"},{"$f":"VLOOKUP(B8:B18,'разряды ж.'!$A$5:$AB$202,3,FALSE)","v":1999},{"$f":"VLOOKUP(B8:B36,'разряды ж.'!$A$5:$AB$202,28,FALSE)","v":"1 юн"},null,7.9,8.7205387205387197,16.620538720538718]
[4,"Кузина Юлия",{"$f":"VLOOKUP(B9:B19,'разряды ж.'!$A$5:$AB$202,2,FALSE)","v":"Бобруйск"},{"$f":"VLOOKUP(B9:B19,'разряды ж.'!$A$5:$AB$202,3,FALSE)","v":1999},{"$f":"VLOOKUP(B9:B37,'разряды ж.'!$A$5:$AB$202,28,FALSE)","v":1},14.9,null,null,14.9]
[5,"Якубович Карина",{"$f":"VLOOKUP(B10:B20,'разряды ж.'!$A$5:$AB$202,2,FALSE)","v":"ЦТиКДМ г. Пинска"},{"$f":"VLOOKUP(B10:B20,'разряды ж.'!$A$5:$AB$202,3,FALSE)","v":1998},{"$f":"VLOOKUP(B10:B38,'разряды ж.'!$A$5:$AB$202,28,FALSE)","v":2},10,null,null,10]
{"$rows_left_out":11}
{"sheet":"мужчины тр.","index":4,"n_rows":50,"n_cols":9,"rows_kept":50,"cut":false,"hidden":false,"merged":[[2,8,4,8],[3,4,4,4],[0,0,0,8],[1,0,1,8],[2,0,2,2],[3,0,4,0],[3,1,4,1],[3,2,4,2],[3,3,4,3]]}
["Текущий рейтинг"]
["Мужчины, трудность"]
["на 1.05.2015 года",null,null,null,null,"ЧРБ-2013","КБ-2014","ЧРБ-2015","общий рез-т"]
["М","Фамилия, Имя","Команда","г.р.","Подтвержденный разряд","Витебск","Витебск","Витебск"]
[null,null,null,null,null,"5-8.12.13","10-13.04.","17-20.04.15"]
[1,"Никифоровец Андрей",{"$f":"VLOOKUP(B6:B42,'разряды м.'!$A$5:$AB$205,2,FALSE)","v":"Минск"},{"$f":"VLOOKUP(B6:B42,'разряды м.'!$A$5:$AB$205,3,FALSE)","v":1974},{"$f":"VLOOKUP(B:B,'разряды м.'!$A$5:$AB$205,28,FALSE)","v":"МС"},95.344010763307452,63.9,66.965769280914841,{"$f":"SUM(F6:H6)","v":226.20978004422227}]
[2,"Клюжев Александр",{"$f":"VLOOKUP(B7:B43,'разряды м.'!$A$5:$AB$205,2,FALSE)","v":"Гомельская обл."},{"$f":"VLOOKUP(B7:B43,'разряды м.'!$A$5:$AB$205,3,FALSE)","v":1997},{"$f":"VLOOKUP(B:B,'разряды м.'!$A$5:$AB$205,28,FALSE)","v":"МС"},76.275208610645961,44.4,86.098846218319068,206.77405482896503]
[3,"Логунов Никита",{"$f":"VLOOKUP(B8:B44,'разряды м.'!$A$5:$AB$205,2,FALSE)","v":"ДЮСШ «Омега» Гом."},{"$f":"VLOOKUP(B8:B44,'разряды м.'!$A$5:$AB$205,3,FALSE)","v":1999},{"$f":"VLOOKUP(B:B,'разряды м.'!$A$5:$AB$205,28,FALSE)","v":"КМС"},61.97360699614984,44.4,52.615961577861654,158.98956857401151]
[4,"Яцыно Павел",{"$f":"VLOOKUP(B9:B45,'разряды м.'!$A$5:$AB$205,2,FALSE)","v":"Витебск"},{"$f":"VLOOKUP(B9:B45,'разряды м.'!$A$5:$AB$205,3,FALSE)","v":1986},{"$f":"VLOOKUP(B:B,'разряды м.'!$A$5:$AB$205,28,FALSE)","v":"КМС"},41.283956660512125,32,43.049423109159534,116.33337976967167]
[5,"Изидеров Никита",{"$f":"VLOOKUP(B10:B46,'разряды м.'!$A$5:$AB$205,2,FALSE)","v":"Полоцк"},{"$f":"VLOOKUP(B10:B46,'разряды м.'!$A$5:$AB$205,3,FALSE)","v":1994},{"$f":"VLOOKUP(B:B,'разряды м.'!$A$5:$AB$205,28,FALSE)","v":"КМС"},52.439205919819102,null,33.482884640457421,85.92209056027653]
{"$rows_left_out":41}
{"sheet":"женщины тр.","index":5,"n_rows":24,"n_cols":9,"rows_kept":24,"cut":false,"hidden":false,"merged":[[3,4,4,4],[3,8,4,8],[0,0,0,4],[1,0,1,4],[2,0,2,2],[3,0,4,0],[3,1,4,1],[3,2,4,2],[3,3,4,3]]}
["Текущий рейтинг"]
["Женщины, трудность"]
["на 1.05.2015 года",null,null,null,null,"ЧРБ-2013","КБ-2014","ЧРБ-2015"]
["Место","Фамилия, Имя","Команда","г.р.","Подтвержденный разряд","Витебск","Витебск","Витебск","общий рез-т"]
[null,null,null,null,null,"5-8.12.13","10-13.04.14","17-20.04.15"]
[1,"Малыженкова Лариса",{"$f":"VLOOKUP($B$6:$B$31,'разряды ж.'!$A$5:$AB$202,2,FALSE)","v":"Минск"},{"$f":"VLOOKUP($B$6:$B$31,'разряды ж.'!$A$5:$AB$202,3,FALSE)","v":1975},{"$f":"VLOOKUP($B$6:$B$31,'разряды ж.'!$A$5:$AB$202,28,FALSE)","v":"КМС"},30.944600212704245,null,23.750833578175303,{"$f":"SUM(F6:H6)","v":54.695433790879548}]
[2,"Федоркевич Светлана",{"$f":"VLOOKUP($B$6:$B$31,'разряды ж.'!$A$5:$AB$202,2,FALSE)","v":"ГОЦТиКДиМ"},{"$f":"VLOOKUP($B$6:$B$31,'разряды ж.'!$A$5:$AB$202,3,FALSE)","v":1992},{"$f":"VLOOKUP($B$6:$B$31,'разряды ж.'!$A$5:$AB$202,28,FALSE)","v":"КМС"},22.018273228270328,30.1,null,52.118273228270326]
[3,"Лясович Наталья",{"$f":"VLOOKUP($B$6:$B$31,'разряды ж.'!$A$5:$AB$202,2,FALSE)","v":"Витебск"},{"$f":"VLOOKUP($B$6:$B$31,'разряды ж.'!$A$5:$AB$202,3,FALSE)","v":1985},{"$f":"VLOOKUP($B$6:$B$31,'разряды ж.'!$A$5:$AB$202,28,FALSE)","v":1},11.306680846949629,16.899999999999999,16.210886410500606,44.41756725745023]
[4,"Самсонова Мария",{"$f":"VLOOKUP($B$6:$B$31,'разряды ж.'!$A$5:$AB$202,2,FALSE)","v":"С/к «Торпедо»  Мг."},{"$f":"VLOOKUP($B$6:$B$31,'разряды ж.'!$A$5:$AB$202,3,FALSE)","v":1984},{"$f":"VLOOKUP($B$6:$B$31,'разряды ж.'!$A$5:$AB$202,28,FALSE)","v":"КМС"},42.846369525282803,null,null,42.846369525282803]
[5,"Кореневская Вероника",{"$f":"VLOOKUP($B$6:$B$31,'разряды ж.'!$A$5:$AB$202,2,FALSE)","v":"Минск"},{"$f":"VLOOKUP($B$6:$B$31,'разряды ж.'!$A$5:$AB$202,3,FALSE)","v":1997},{"$f":"VLOOKUP($B$6:$B$31,'разряды ж.'!$A$5:$AB$202,28,FALSE)","v":2},13.68703470946534,8.6,10.55592603474458,32.842960744209918]
{"$rows_left_out":15}
{"sheet":"разряды м.","index":6,"n_rows":204,"n_cols":28,"rows_kept":204,"cut":false,"hidden":false,"merged":[[1,24,1,26],[1,15,1,23],[2,22,2,23],[2,24,2,25],[2,20,2,21],[1,3,1,4],[2,3,2,4],[2,10,2,11],[2,8,2,9],[2,18,2,19],[1,5,1,13],[2,12,2,13]]}
[]
[null,null,null,2013,null,2014,null,null,null,null,null,null,null,null,null,2015,null,null,null,null,null,null,null,null,2013]
[null,null,null,"Чемпионат и первенство Беларуси, Витебск, 5-9.12.2013",null,"Первенство Беларуси, Минск, 21-22.02.2014 ","Чемпионат Беларуси, Минск, 21-23.02.2014 ","Первенство Беларуси, Минск, 21-23.03.2014","Первенство Гомеля, 4-6.04.2014",null,"Кубок Беларуси, Витебск, 12-13.04.2014",null,"Первенство Беларуси, Гомель, 7-8.11.2014",null,"Кубок Беларуси, Пинск, 22-23.11.2014","Первенство Гом. обл., 31.01-1.02.1015","Чемпионат и первенство Беларуси, Минск, 27.02-1.03.2015 ","Первенство Беларуси, Минск, 21-22.03.2015 ","Первенство Гомеля, 3-5.04.2015",null,"Чемпионат и первенство Беларуси, Витебск, 17-20.04.2015",null,"Первенство Минска, Минск, 16-17.05.2015 ",null,"Первенство Беларуси, Пинск, 21-22.11.2013",null,"Кубок Беларуси, Пинск, 22-24.11.2013","Текущий разряд"]
["Фамилия, Имя","команда","г.р.","С","Т","Б","Б","Б","С","Т","С","Т","С","Т","Б","Б","Б","Б","С","Т","С","Т","С","Т","Т","С","Б"]
["Аблажевич Виктор","Гомельская обл.",2000,null,3,null,null,null,null,null,2,2,null,null,null,null,2,null,null,null,2,null,null,null,2,3,null,{"$f":"IF(OR(D5=\"МС\",E5=\"МС\",F5=\"МС\",G5=\"МС\",H5=\"МС\",I5=\"МС\",J5=\"МС\",K5=\"МС\",L5=\"МС\",M5=\"МС\",N5=\"МС\",O5=\"МС\",P5=\"МС\",Q5=\"МС\",R5=\"МС\",S5=\"МС\",T5=\"МС\",U5=\"МС\",V5=\"МС\",W5=\"МС\",X5=\"МС\",Y5=\"МС\",Z5=\"МС\",AA5=\"МС\"),\"МС\",IF(OR(D5=\"КМС\",E5=\"КМС\",F5=\"КМС\",G5=\"КМС\",H5=\"КМС\",I5=\"КМС\",J5=\"КМС\",K5=\"КМС\",L5=\"КМС\",M5=\"КМС\",N5=\"КМС\",O5=\"КМС\",P5=\"КМС\",Q5=\"КМС\",R5=\"КМС\",S5=\"КМС\",T5=\"КМС\",U5=\"КМС\",V5=\"КМС\",W5=\"КМС\",X5=\"КМС\",Y5=\"КМС\",Z5=\"КМС\",AA5=\"КМС\"),\"КМС\",IF(OR(D5=1,E5=1,F5=1,G5=1,H5=1,I5=1,J5=1,K5=1,L5=1,M5=1,N5=1,O5=1,P5=1,Q5=1,R5=1,S5=1,T5=1,U5=1,V5=1,W5=1,X5=1,Y5=1,Z5=1,AA5=1),1,IF(OR(D5=2,E5=2,F5=2,G5=2,H5=2,I5=2,J5=2,K5=2,L5=2,M5=2,N5=2,O5=2,P5=2,Q5=2,R5=2,S5=2,T5=2,U5=2,V5=2,W5=2,X5=2,Y5=2,Z5=2,AA5=2),2,IF(OR(D5=3,E5=3,F5=3,G5=3,H5=3,I5=3,J5=3,K5=3,L5=3,M5=3,N5=3,O5=3,P5=3,Q5=3,R5=3,S5=3,T5=3,U5=3,V5=3,W5=3,X5=3,Y5=3,Z5=3,AA5=3),3,IF(OR(D5=\"1 юн\",E5=\"1 юн\",F5=\"1 юн\",G5=\"1 юн\",H5=\"1 юн\",I5=\"1 юн\",J5=\"1 юн\",K5=\"1 юн\",L5=\"1 юн\",M5=\"1 юн\",N5=\"1 юн\",O5=\"1 юн\",P5=\"1 юн\",Q5=\"1 юн\",R5=\"1 юн\",S5=\"1 юн\",T5=\"1 юн\",U5=\"1 юн\",V5=\"1 юн\",W5=\"1 юн\",X5=\"1 юн\",Y5=\"1 юн\",Z5=\"1 юн\",AA5=\"1 юн\"),\"1 юн\",IF(OR(D5=\"юн\",E5=\"юн\",F5=\"юн\",G5=\"юн\",H5=\"юн\",I5=\"юн\",J5=\"юн\",K5=\"юн\",L5=\"юн\",M5=\"юн\",N5=\"юн\",O5=\"юн\",P5=\"юн\",Q5=\"юн\",R5=\"юн\",S5=\"юн\",T5=\"юн\",U5=\"юн\",V5=\"юн\",W5=\"юн\",X5=\"юн\",Y5=\"юн\",Z5=\"юн\",AA5=\"юн\"),\"юн\",\"б/р\")))))))","v":2}]
["Адамович Дмитрий","Брестская область",1997,null,null,null,null,null,null,null,null,null,null,null,null,null,null,null,null,null,null,null,null,null,null,null,null,"б/р"]
["Аксенов Павел","Витебск",1989,null,null,null,1,null,null,null,null,null,null,null,null,null,null,null,null,null,null,null,null,null,null,null,null,1]
["Астапов Максим","ГОЦТиКДиМ Гомель",2001,null,null,null,null,3,2,null,null,null,"1 юн",2,null,null,3,null,null,null,null,null,null,null,null,"юн",null,2]
["Астапчик Дмитрий","Пуховичский р-н",2003,null,null,null,null,"юн",null,null,null,null,"юн","юн",null,null,null,null,null,"юн",null,null,null,"юн",null,null,null,"юн"]
["Астапчик Павел","Пуховичский р-н",2006,null,null,null,null,null,null,null,null,null,null,"юн",null,null,null,"юн",null,"юн",null,null,null,"1 юн",null,null,null,"1 юн"]
{"$rows_left_out":195}
{"sheet":"разряды ж.","index":7,"n_rows":100,"n_cols":28,"rows_kept":100,"cut":false,"hidden":false,"merged":[[4,23,99,23],[2,12,2,13],[2,24,2,25],[1,3,1,4],[2,3,2,4],[2,20,2,21],[2,10,2,11],[2,8,2,9],[1,5,1,14],[2,18,2,19],[1,24,1,26],[2,22,2,23],[1,15,1,23],[4,5,99,5],[4,3,99,3],[4,20,99,20],[4,21,99,21],[4,10,99,10],[4,11,99,11],[4,22,99,22]]}
[]
[null,null,null,2013,null,2014,null,null,null,null,null,null,null,null,null,2015,null,null,null,null,null,null,null,null,2013]
[null,null,null,"Чемпионат и первенство Беларуси, Витебск, 5-9.12.2013",null,"Первенство Беларуси, Минск, 21-22.02.2014 ","Чемпионат Беларуси, Минск, 21-23.02.2014 ","Первенство Беларуси, Минск, 21-23.03.2014","Первенство Гомеля, 4-6.04.2014",null,"Кубок Беларуси, Витебск, 12-13.04.2014",null,"Первенство Беларуси, Гомель, 7-8.11.2014",null,"Кубок Беларуси, Пинск, 22-23.11.2014","Первенство Гом. обл., 31.01-1.02.1015","Чемпионат Беларуси, Минск, 27.02-1.03.2015 ","Первенство Беларуси, Минск, 21-22.03.2015 ","Первенство Гомеля, 3-5.04.2015",null,"Чемпионат и первенство Беларуси, Витебск, 17-20.04.2015",null,"Первенство Минска, Минск, 16-17.05.2015 ",null,"Первенство Беларуси, Пинск, 21-22.11.2013",null,"Кубок Беларуси, Пинск, 22-24.11.2013","Текущий разряд"]
["Фамилия, Имя","команда","г.р.","С","Т","Б","Б","Б","С","Т","С","Т","С","Т","Б","Б","Б","Б","С","Т","С","Т","С","Т","Т","С","Б"]
["Авило Вера","РЦЭК",2006,"разряды не выполнялись из-за малого количества участников",null,"разряды не выполнялись из-за малого количества участников",null,null,null,null,"разряды не выполнялись из-за малого количества участников","разряды не выполнялись из-за малого количества участников",null,null,null,null,null,null,null,null,"разряды не выполнялись из-за малого количества участников","разряды не выполнялись из-за малого количества участников","разряды не выполнялись из-за малого количества участников","разряды не выполнялись из-за малого количества участников",null,null,null,{"$f":"IF(OR(D5=\"МС\",E5=\"МС\",F5=\"МС\",G5=\"МС\",H5=\"МС\",I5=\"МС\",J5=\"МС\",K5=\"МС\",L5=\"МС\",M5=\"МС\",N5=\"МС\",O5=\"МС\",P5=\"МС\",Q5=\"МС\",R5=\"МС\",S5=\"МС\",T5=\"МС\",U5=\"МС\",V5=\"МС\",W5=\"МС\",X5=\"МС\",Y5=\"МС\",Z5=\"МС\",AA5=\"МС\"),\"МС\",IF(OR(D5=\"КМС\",E5=\"КМС\",F5=\"КМС\",G5=\"КМС\",H5=\"КМС\",I5=\"КМС\",J5=\"КМС\",K5=\"КМС\",L5=\"КМС\",M5=\"КМС\",N5=\"КМС\",O5=\"КМС\",P5=\"КМС\",Q5=\"КМС\",R5=\"КМС\",S5=\"КМС\",T5=\"КМС\",U5=\"КМС\",V5=\"КМС\",W5=\"КМС\",X5=\"КМС\",Y5=\"КМС\",Z5=\"КМС\",AA5=\"КМС\"),\"КМС\",IF(OR(D5=1,E5=1,F5=1,G5=1,H5=1,I5=1,J5=1,K5=1,L5=1,M5=1,N5=1,O5=1,P5=1,Q5=1,R5=1,S5=1,T5=1,U5=1,V5=1,W5=1,X5=1,Y5=1,Z5=1,AA5=1),1,IF(OR(D5=2,E5=2,F5=2,G5=2,H5=2,I5=2,J5=2,K5=2,L5=2,M5=2,N5=2,O5=2,P5=2,Q5=2,R5=2,S5=2,T5=2,U5=2,V5=2,W5=2,X5=2,Y5=2,Z5=2,AA5=2),2,IF(OR(D5=3,E5=3,F5=3,G5=3,H5=3,I5=3,J5=3,K5=3,L5=3,M5=3,N5=3,O5=3,P5=3,Q5=3,R5=3,S5=3,T5=3,U5=3,V5=3,W5=3,X5=3,Y5=3,Z5=3,AA5=3),3,IF(OR(D5=\"1 юн\",E5=\"1 юн\",F5=\"1 юн\",G5=\"1 юн\",H5=\"1 юн\",I5=\"1 юн\",J5=\"1 юн\",K5=\"1 юн\",L5=\"1 юн\",M5=\"1 юн\",N5=\"1 юн\",O5=\"1 юн\",P5=\"1 юн\",Q5=\"1 юн\",R5=\"1 юн\",S5=\"1 юн\",T5=\"1 юн\",U5=\"1 юн\",V5=\"1 юн\",W5=\"1 юн\",X5=\"1 юн\",Y5=\"1 юн\",Z5=\"1 юн\",AA5=\"1 юн\"),\"1 юн\",IF(OR(D5=\"юн\",E5=\"юн\",F5=\"юн\",G5=\"юн\",H5=\"юн\",I5=\"юн\",J5=\"юн\",K5=\"юн\",L5=\"юн\",M5=\"юн\",N5=\"юн\",O5=\"юн\",P5=\"юн\",Q5=\"юн\",R5=\"юн\",S5=\"юн\",T5=\"юн\",U5=\"юн\",V5=\"юн\",W5=\"юн\",X5=\"юн\",Y5=\"юн\",Z5=\"юн\",AA5=\"юн\"),\"юн\",\"б/р\")))))))","v":"б/р"}]
["Андреева Елена","Гомельская обл.",1982,null,null,null,"КМС",null,null,null,null,null,null,null,2,null,null,null,null,null,null,null,null,null,null,null,2,{"$f":"IF(OR(D6=\"МС\",E6=\"МС\",F6=\"МС\",G6=\"МС\",H6=\"МС\",I6=\"МС\",J6=\"МС\",K6=\"МС\",L6=\"МС\",M6=\"МС\",N6=\"МС\",O6=\"МС\",P6=\"МС\",Q6=\"МС\",R6=\"МС\",S6=\"МС\",T6=\"МС\",U6=\"МС\",V6=\"МС\",W6=\"МС\",X6=\"МС\",Y6=\"МС\",Z6=\"МС\",AA6=\"МС\"),\"МС\",IF(OR(D6=\"КМС\",E6=\"КМС\",F6=\"КМС\",G6=\"КМС\",H6=\"КМС\",I6=\"КМС\",J6=\"КМС\",K6=\"КМС\",L6=\"КМС\",M6=\"КМС\",N6=\"КМС\",O6=\"КМС\",P6=\"КМС\",Q6=\"КМС\",R6=\"КМС\",S6=\"КМС\",T6=\"КМС\",U6=\"КМС\",V6=\"КМС\",W6=\"КМС\",X6=\"КМС\",Y6=\"КМС\",Z6=\"КМС\",AA6=\"КМС\"),\"КМС\",IF(OR(D6=1,E6=1,F6=1,G6=1,H6=1,I6=1,J6=1,K6=1,L6=1,M6=1,N6=1,O6=1,P6=1,Q6=1,R6=1,S6=1,T6=1,U6=1,V6=1,W6=1,X6=1,Y6=1,Z6=1,AA6=1),1,IF(OR(D6=2,E6=2,F6=2,G6=2,H6=2,I6=2,J6=2,K6=2,L6=2,M6=2,N6=2,O6=2,P6=2,Q6=2,R6=2,S6=2,T6=2,U6=2,V6=2,W6=2,X6=2,Y6=2,Z6=2,AA6=2),2,IF(OR(D6=3,E6=3,F6=3,G6=3,H6=3,I6=3,J6=3,K6=3,L6=3,M6=3,N6=3,O6=3,P6=3,Q6=3,R6=3,S6=3,T6=3,U6=3,V6=3,W6=3,X6=3,Y6=3,Z6=3,AA6=3),3,IF(OR(D6=\"1 юн\",E6=\"1 юн\",F6=\"1 юн\",G6=\"1 юн\",H6=\"1 юн\",I6=\"1 юн\",J6=\"1 юн\",K6=\"1 юн\",L6=\"1 юн\",M6=\"1 юн\",N6=\"1 юн\",O6=\"1 юн\",P6=\"1 юн\",Q6=\"1 юн\",R6=\"1 юн\",S6=\"1 юн\",T6=\"1 юн\",U6=\"1 юн\",V6=\"1 юн\",W6=\"1 юн\",X6=\"1 юн\",Y6=\"1 юн\",Z6=\"1 юн\",AA6=\"1 юн\"),\"1 юн\",IF(OR(D6=\"юн\",E6=\"юн\",F6=\"юн\",G6=\"юн\",H6=\"юн\",I6=\"юн\",J6=\"юн\",K6=\"юн\",L6=\"юн\",M6=\"юн\",N6=\"юн\",O6=\"юн\",P6=\"юн\",Q6=\"юн\",R6=\"юн\",S6=\"юн\",T6=\"юн\",U6=\"юн\",V6=\"юн\",W6=\"юн\",X6=\"юн\",Y6=\"юн\",Z6=\"юн\",AA6=\"юн\"),\"юн\",\"б/р\")))))))","v":"КМС"}]
["Андренко Алина","ГОЦТиКДиМ",1998,null,null,null,null,null,null,null,null,null,null,null,null,null,null,null,null,null,null,null,null,null,null,null,null,"б/р"]
["Астапова Анастасия","СШ №1 г. Ветка",2002,null,null,null,null,null,"1 юн",null,null,null,null,null,null,null,null,null,null,null,null,null,null,null,null,null,null,"1 юн"]
["Баева Диана","МогилёвскийОЦФВиС",2000,null,null,null,2,null,null,null,null,null,null,null,3,null,null,null,null,null,null,null,null,null,3,2,null,2]
["Бардашевич Ульяна","ГОЦТиКДиМ",2003,null,null,null,null,null,null,null,null,null,"юн",null,null,null,null,null,null,null,null,null,null,null,null,null,null,"юн"]
{"$rows_left_out":91}
{"sheet":"Лист1","index":8,"n_rows":159,"n_cols":7,"rows_kept":159,"cut":false,"hidden":false,"merged":[]}
[]
["Подтвержденные разряды на 01.01.2015"]
[]
["Фамилия, Имя","г.р.","разряд",null,"Фамилия, Имя","г.р.","разряд"]
["Аблажевич Виктор",2000,2,null,"Андреева Лена",1984,2]
["Аксенов Павел",1989,1,null,"Андреева Елена",1982,"КМС"]
["Анищенко Павел",2000,3,null,"Астапова Анастасия",2002,"1 юн"]
["Астапов Максим",2001,2,null,"Баева Диана",2000,2]
["Астапчик Дмитрий",2003,"юн",null,"Бардашевич Ульяна",2003,"юн"]
["Астапчик Павел",2006,"юн",null,"Болсун Софья",1998,"юн"]
{"$rows_left_out":149}